20 янв 2017 ... Обратим внимание на строку: error: 'thread' in namespace 'std' does not name ..... undefined reference to `__imp_OleCreatePropertyFrame'

  habr.com

make all-recursive make[1]: вход в каталог «/home/admin/Downloads/focusblur- 3.2.6» Making all in po make[2]: вход в каталог ...

  www.linux.org.ru

24 фев 2015 ... 1 lib/cpp/.libs/libthrift.so: undefined reference to `TLSv1_method'. 2 lib/cpp/.libs/ libthrift.so: .... 4 code. => 500,. 5 message => 'System error'. 6.

  pragmaticperl.com

... In function `main': index.cpp:(.text+0x11): undefined reference to `getText()' collect2: выполнение ld завершилось с кодом возврата 1.

  www.linux.org.ru

libs/libtonezone.so: undefined reference to `cos' ./.libs/libtonezone.so: undefined reference to `pow' collect2: error: ld returned 1 exit status ...

  unixforum.org

7 ноя 2017 ... ... на символ «[email protected]@GLIBC_2.2.5» /lib/x86_64-linux-gnu/libdl.so.2:-1: ошибка: error adding symbols: DSO missing from command line.

  toster.ru

9 дек 2018 ... Некоторые части производны от Lua 5.1 reference manual, доступного под лицензией MIT. ... 2.8 Error handling; 2.9 Garbage collection ... 3.3.5 math.atan2; 3.3.6 math.ceil; 3.3.7 math.cos; 3.3.8 math.cosh ..... Note that behavior is undefined if this field is altered after the table is used as a metatable.

  www.mediawiki.org

28 янв 2018 ... Объект arguments — это подобный массиву объект, который содержит аргументы, переданные в функцию.

  developer.mozilla.org

15 ноя 2018 ... Метод вернёт NaN , если в него передать нечисловую строку или значение undefined /ничего не передавать. Метод вернёт 0, если в ...

  developer.mozilla.org

libpthread.so.0: error adding symbols: DSO missing from command line ... test g ++ -lrt test.cpp -o test /usr/bin/ld: /tmp/cc8fR82D.o: undefined reference to symbol  ...

  ru.stackoverflow.com

При попытке рассчитать cos от числа программа работает нормально. Расчёт же cos от переменной даёт ошибку Undefined reference to cos.

  otvet.mail.ru

hello forum I got "undefined reference to `cos' error" for ARM Cortex M4. where to change below Eclipse makefile ? thank you.

  embdev.net

Here is the co. Undefined Reference to Main Error.

  bighow.org

- Crosscompiling to ARM results in `error: undefined reference to 'cos'` Crosscompilation is done either using: gomobile bind -target android . or env CC=$HOME/pkg/gomobile/android-ndk-r10e/arm/bin/arm-linux-androideabi-gcc CGO_ENABLED=1 GOOS=android GOARCH=arm GOARM...

  grokbase.com

Possible Duplicate: C Build error when getting the value of sin() I am trying to integrate a function using 100 intervals within the period, so I'm using a for loop.

  javascript.wekeepcoding.com

And when I tried to compile, I got the error below: /tmp/ccEPoXwg.o: In function `main': test.c:(.text+0x6b): undefined reference to `cos' collect2: ld returned 1

  www.codeproject.com

Solved QT base compiling error. This topic has been deleted. Only users with topic management privileges can see it.

  forum.qt.io

I am trying to integrate a function using 100 intervals within the period, so I'm using a for loop. The function contains cos(stuff here), but it won't run within the for loop for some reason.

  stackoverflow.com

Date: Sat, 05 Apr 2003 06:30:56 +0530. Subject: Error: undefined reference to cos. I am using gcc 3.2 on Red Hat Linux 8.0 When I compiled the C program given below using the command

  gcc.gnu.org

Мировые новости: